{"text_format":"1","workbook":"xlsx","n_sheets":6,"sheets":["ITF Form","Lists","Form Data","Rules","Business Office Use Only","Sheet1"],"not_rendered":{"charts":0,"images":0,"macros":1,"external_links":0,"defined_names":4,"comments":0,"pivot_tables":0},"unopened":[],"bounds":{"document_bytes":16777216,"sheet_cells":100000,"rows_first":2000,"rows_last":500,"rows_between":2000,"halvings":0,"cell_chars":16384,"cell_head_chars":4096},"cells_cut":0,"cells_raw":0,"read":"whole","date_system":"1900"}

{"sheet":"ITF Form","index":0,"n_rows":80,"n_cols":15,"rows_kept":80,"cut":false,"hidden":false,"merged":[[1,1,1,14],[7,1,7,13],[80,1,81,14],[79,1,79,14],[78,1,78,14],[54,1,54,13],[19,1,19,14],[61,4,61,7],[27,2,27,4],[21,2,21,4],[23,2,23,4],[25,2,25,4],[29,2,29,4],[31,2,31,4],[29,9,29,11],[31,9,31,11],[6,1,6,13],[39,1,39,13],[72,1,72,2],[35,1,37,13],[41,1,43,13],[64,1,64,14],[69,2,69,3]]}
[]
[null,"Interlocation Transfer of Funds Form"]
[]
[null,"The Central Budget Office (CBO) must provide the offset COA for every transfer that is coming from another campus."]
[]
[null,"Submit completed form to CBO via Google Forms prior to sending or receiving funds from another campus. ",null,null,null,null,null,null,"Take me to Google Form"]
[]
[null,"The CBO must have the request prior to the 20th of each month to post to current period for funds going out of UCR. "]
[null,"Delays in posting may occur for funds being received by another campus and dependant on their submission."]
[]
[null,"If this ITF involves a transfer of funds related to an intramurally funded award (by the RGPO (Research Grants Program Office) from either UCOP or another UC Campus, \n "]
[null,"then the ITF requestor is responsible for identifying if the award requires an IDC (Indirect Cost Recovery) transfer and must include (via the Google Form)  the itemized budget showing the IDC value and the details of the award. "]
[]
[null,"If the requestor does not identify any IDC for the ITF requested, then no IDC will be requested for the campus."]
[]
[null,"Instructions: "]
[null,"Please only fill out the sheet in this Excel workbook labeled 'ITF form'. All other sheets are for CBO use only."]
[null,"You are required to fill out Section 2 if you are sending funds to another campus."]
[]
[null,"Section 1. Required Fields for UCR Campus Unit"]
{"$rows_left_out":61}
{"sheet":"Lists","index":1,"n_rows":47,"n_cols":19,"rows_kept":47,"cut":false,"hidden":true,"merged":[]}
[]
["Y/N",null,"Type",null,"Year",null,"Month",null,"ListNum","Campus",null,"Entity","Campus",null,null,"Function","Function Description",null,"Transfer Type"]
["Select",null,"Select",null,"Select",null,"Select",null,1,"Select",null,1111,"UCB",null,null,"00"," DEFAULT FUNCTION",null,"Select"]
["Yes",null,"Receiving",null,2025,null,"July",null,2,"ANR",null,1131,"UCB - ANR",null,null,"40"," INSTRUCTION",null,"Temp (GL Transfer)"]
["No",null,"Sending",null,2026,null,"August",null,3,"UCB",null,1141,"UCB - UCOP",null,null,"41"," SUMMER SESSION",null,"Perm  [Omit Cents]"]
["N/A",null,null,null,2027,null,"September",null,4,"UCD",null,1211,"UCSF",null,null,"43"," ACADEMIC SUPPORT"]
[null,null,null,null,2028,null,"October",null,5,"UCI",null,1212,"UCSF - CFIA",null,null,"44"," RESEARCH"]
[null,null,null,null,2029,null,"November",null,6,"UCLA",null,1221,"UCSF - Medical Center",null,null,"49"," CLINICAL OPERATIONS"]
[null,null,null,null,2030,null,"December",null,7,"UCM",null,1222,"UCSF - Children's Hospital",null,null,"60"," LIBRARIES"]
[null,null,null,null,2031,null,"January",null,8,"UCOP",null,1231,"UCSF - ANR",null,null,"61"," UNIVERSITY EXTENSION"]
[null,null,null,null,2032,null,"February",null,9,"UCSB",null,1241,"UCSF - UCOP",null,null,"62"," PUBLIC SERVICE"]
[null,null,null,null,2033,null,"March",null,10,"UCSC",null,1311,"UCD",null,null,"64"," OPERATIONS & MNTNCE OF PLANT"]
[null,null,null,null,2034,null,"April",null,11,"UCSD",null,1312,"UCD - CHF",null,null,"65"," DEPRECIATION EXPENSE"]
[null,null,null,null,2035,null,"May",null,12,"UCSF",null,1321,"UCD - Medical Center",null,null,"66"," IMPAIRMENT EXPENSE"]
[null,null,null,null,2036,null,"June",null,null,null,null,1331,"UCD - ANR",null,null,"68"," STUDENT SERVICES"]
[null,null,null,null,2037,null,null,null,null,null,null,1341,"UCD - UCOP",null,null,"72"," INSTITU SUPPORT&GENERAL ADMIN"]
[null,null,null,null,2038,null,null,null,null,null,null,1411,"UCLA",null,null,"76"," AUXILIARY ENTERPRISES"]
[null,null,null,null,null,null,null,null,null,null,null,1421,"UCLA - Medical Center",null,null,"78"," STUDENT FINANCIAL AID"]
[null,null,null,null,null,null,null,null,null,null,null,1431,"UCLA - ANR",null,null,"80"," PROVISIONS FOR ALLOCATION"]
[null,null,null,null,null,null,null,null,null,null,null,1441,"UCLA - UCOP"]
{"$rows_left_out":28}
{"sheet":"Form Data","index":2,"n_rows":101,"n_cols":45,"rows_kept":101,"cut":false,"hidden":false,"merged":[[5,9,5,11]]}
[]
[null,"Receiving/Sending",{"$f":"IF('ITF Form'!C22=2,\"R\", IF('ITF Form'!C22=3,\"S\",\"Select\"))","v":"Select"}]
[null,"Fiscal Year",{"$f":"'ITF Form'!C24","v":1}]
[null,"Month",{"$f":"'ITF Form'!C26","v":1}]
[null,"Other Campus",{"$f":"VLOOKUP('ITF Form'!C28,campus[],2,FALSE)","v":"Select"}]
[null,"Other Campus Contact Name",{"$f":"'ITF Form'!C32","v":0}]
[null,"Other Campus Contact Email",{"$f":"'ITF Form'!J32","v":0}]
[null,"Subject Line (200 char max)",{"$f":"'ITF Form'!B36","v":0}]
[null,"Explanation (500-char max)",{"$f":"IF(D10=\"Yes\",'ITF Form'!B42 & \" \" &C12, 'ITF Form'!B42)","v":" NO FINANCIAL JOURNAL REQUIRED_MUST BE EXPENSE CLAIMED"}]
[null,"Expense Claim",{"$f":"'ITF Form'!F60","v":2},{"$f":"IF(C10=2,\"Yes\", IF(C10=3,\"No\",\"\"))","v":"Yes"}]
[]
[null,"Expense Claim Notice","NO FINANCIAL JOURNAL REQUIRED_MUST BE EXPENSE CLAIMED"]
[null,"Transfer Type",{"$f":"'ITF Form'!C70","v":2},{"$f":"IF(C13=2,\"Temp\", IF(C13=3,\"Perm\",\"\"))","v":"Temp"}]
[]
[]
[]
[null,"UCR Local Unit COA(s)","Campus","Entity (4-char)","BC (4-char)","Activity (6-char)","Fund (5-char)","Function (2-char)","Program (3-char)","Project (10-char)","Flex1 (10-char)","Flex2 (8-char)","Description (30-char limit)","Amount",null,null,null,null,null,null,null,null,null,null,null,null,"UCR COA Details for UCOP Template","Campus ","Entity Level C","\nAccount \nLevel E","Account Level D","Fund\nLevel D","Fund Level C","Function","Dept","Project","Program","GL Transfer From (DR.)","GL Transfer To (CR.)","Perm. Trf. From (DR.)  [Omit Cents]","Perm. Trf. To (CR.) [Omit Cents]","Description  (30-char limit)","Campus Comments \n(60-char limit)","Flex1","Flex2"]
[null,1,"UCR",{"$f":"INDIRECT(\"'ITF Form'!D49\")","v":0},{"$f":"INDIRECT(\"'ITF Form'!e49\")","v":0},{"$f":"INDIRECT(\"'ITF Form'!f49\")","v":0},{"$f":"IF(INDIRECT(\"'ITF Form'!g49\")=\"69763\", \"69761\", INDIRECT(\"'ITF Form'!g49\"))","v":0},{"$f":"INDIRECT(\"'ITF Form'!h49\")","v":0},{"$f":"INDIRECT(\"'ITF Form'!i49\")","v":0},{"$f":"INDIRECT(\"'ITF Form'!j49\")","v":0},{"$f":"INDIRECT(\"'ITF Form'!k49\")","v":0},{"$f":"INDIRECT(\"'ITF Form'!l49\")","v":0},{"$f":"INDIRECT(\"'ITF Form'!m49\")","v":0},{"$f":"IF($D$13=\"Perm\",ROUND(INDIRECT(\"'ITF Form'!n49\"),0),INDIRECT(\"'ITF Form'!n49\"))","v":0},{"$f":"IF($D$13=\"Perm\",ROUND(INDIRECT(\"'ITF Form'!n49\"),0),INDIRECT(\"'ITF Form'!n49\"))","v":0},{"$f":"IF($D$13=\"Perm\",ROUND(INDIRECT(\"'ITF Form'!n49\"),0),INDIRECT(\"'ITF Form'!n49\"))","v":0},{"$f":"IF($D$13=\"Perm\",ROUND(INDIRECT(\"'ITF Form'!n49\"),0),INDIRECT(\"'ITF Form'!n49\"))","v":0},{"$f":"IF($D$13=\"Perm\",ROUND(INDIRECT(\"'ITF Form'!n49\"),0),INDIRECT(\"'ITF Form'!n49\"))","v":0},{"$f":"IF($D$13=\"Perm\",ROUND(INDIRECT(\"'ITF Form'!n49\"),0),INDIRECT(\"'ITF Form'!n49\"))","v":0},{"$f":"IF($D$13=\"Perm\",ROUND(INDIRECT(\"'ITF Form'!n49\"),0),INDIRECT(\"'ITF Form'!n49\"))","v":0},{"$f":"IF($D$13=\"Perm\",ROUND(INDIRECT(\"'ITF Form'!n49\"),0),INDIRECT(\"'ITF Form'!n49\"))","v":0},{"$f":"IF($D$13=\"Perm\",ROUND(INDIRECT(\"'ITF Form'!n49\"),0),INDIRECT(\"'ITF Form'!n49\"))","v":0},{"$f":"IF($D$13=\"Perm\",ROUND(INDIRECT(\"'ITF Form'!n49\"),0),INDIRECT(\"'ITF Form'!n49\"))","v":0},{"$f":"IF($D$13=\"Perm\",ROUND(INDIRECT(\"'ITF Form'!n49\"),0),INDIRECT(\"'ITF Form'!n49\"))","v":0},{"$f":"IF($D$13=\"Perm\",ROUND(INDIRECT(\"'ITF Form'!n49\"),0),INDIRECT(\"'ITF Form'!n49\"))","v":0},null,"Transfer 1","UCR",{"$f":"IF($D18=0,\"\",$D18)","v":""},{"$f":"IF($D18=0,\"\",IF($C$2=\"S\",VLOOKUP($C$5,ITFAccounts[],2,FALSE),IF($C$2=\"R\",VLOOKUP($C$5,ITFAccounts[],3,FALSE),\"\")))","v":""},null,{"$f":"IF($G18=0,\"\",$G18)","v":""},null,{"$f":"IF($H18=0,\"\",$H18)","v":""},{"$f":"IF(D18=0,\"\",IF(D18=\"1531\",\"A41479\",\"A01479\"))","v":""},null,null,{"$f":"IF($D$13=\"Temp\",IF($C$2=\"S\",IF($N18=0,\"\",$N18),\"\"),\"\")","v":""},{"$f":"IF($D$13=\"Temp\",IF($C$2=\"R\",IF($N18=0,\"\",$N18),\"\"),\"\")","v":""},{"$f":"IF($D$13=\"Perm\",IF($C$2=\"S\",IF($N18=0,\"\",$N18),\"\"),\"\")","v":""},{"$f":"IF($D$13=\"Perm\",IF($C$2=\"R\",IF($N18=0,\"\",$N18),\"\"),\"\")","v":""},{"$f":"IF($M18=0,\"\",$M18)","v":""},{"$f":"IF($D18=0,\"\",_xlfn.CONCAT($C$5,\"-\",D18,\"-\",E18,\"-\",F18,\"-\",G18,\"-\",H18,\"-\",I18,\"-\",K18,\"-\",L18,\"-\",IF($D$10=\"Yes\",\"EC\",\"\")))","v":""}]
[null,2,"UCR",{"$f":"INDIRECT(\"'ITF Form'!D50\")","v":0},{"$f":"INDIRECT(\"'ITF Form'!e50\")","v":0},{"$f":"INDIRECT(\"'ITF Form'!f50\")","v":0},{"$f":"IF(INDIRECT(\"'ITF Form'!g50\")=\"69763\", \"69761\", INDIRECT(\"'ITF Form'!g50\"))","v":0},{"$f":"INDIRECT(\"'ITF Form'!h50\")","v":0},{"$f":"INDIRECT(\"'ITF Form'!i50\")","v":0},{"$f":"INDIRECT(\"'ITF Form'!j50\")","v":0},{"$f":"INDIRECT(\"'ITF Form'!k50\")","v":0},{"$f":"INDIRECT(\"'ITF Form'!l50\")","v":0},{"$f":"INDIRECT(\"'ITF Form'!m50\")","v":0},{"$f":"IF($D$13=\"Perm\",ROUND(INDIRECT(\"'ITF Form'!n50\"),0),INDIRECT(\"'ITF Form'!n50\"))","v":0},null,null,null,null,null,null,null,null,null,null,null,null,"Transfer 2","UCR",{"$f":"IF($D19=0,\"\",$D19)","v":""},{"$f":"IF($D19=0,\"\",IF($C$2=\"S\",VLOOKUP($C$5,ITFAccounts[],2,FALSE),IF($C$2=\"R\",VLOOKUP($C$5,ITFAccounts[],3,FALSE),\"\")))","v":""},null,{"$f":"IF($G19=0,\"\",$G19)","v":""},null,{"$f":"IF($H19=0,\"\",$H19)","v":""},{"$f":"IF(D19=0,\"\",IF(D19=\"1531\",\"A41479\",\"A01479\"))","v":""},null,null,{"$f":"IF($D$13=\"Temp\",IF($C$2=\"S\",IF($N19=0,\"\",$N19),\"\"),\"\")","v":""},{"$f":"IF($D$13=\"Temp\",IF($C$2=\"R\",IF($N19=0,\"\",$N19),\"\"),\"\")","v":""},{"$f":"IF($D$13=\"Perm\",IF($C$2=\"S\",IF($N19=0,\"\",$N19),\"\"),\"\")","v":""},{"$f":"IF($D$13=\"Perm\",IF($C$2=\"R\",IF($N19=0,\"\",$N19),\"\"),\"\")","v":""},{"$f":"IF($M19=0,\"\",$M19)","v":""},{"$f":"IF($D19=0,\"\",_xlfn.CONCAT($C$5,\"-\",D19,\"-\",E19,\"-\",F19,\"-\",G19,\"-\",H19,\"-\",I19,\"-\",K19,\"-\",L19,\"-\",IF($D$10=\"Yes\",\"EC\",\"\")))","v":""}]
[null,3,"UCR",{"$f":"INDIRECT(\"'ITF Form'!D51\")","v":0},{"$f":"INDIRECT(\"'ITF Form'!e51\")","v":0},{"$f":"INDIRECT(\"'ITF Form'!f51\")","v":0},{"$f":"IF(INDIRECT(\"'ITF Form'!g51\")=\"69763\", \"69761\", INDIRECT(\"'ITF Form'!g51\"))","v":0},{"$f":"INDIRECT(\"'ITF Form'!h51\")","v":0},{"$f":"INDIRECT(\"'ITF Form'!i51\")","v":0},{"$f":"INDIRECT(\"'ITF Form'!j51\")","v":0},{"$f":"INDIRECT(\"'ITF Form'!k51\")","v":0},{"$f":"INDIRECT(\"'ITF Form'!l51\")","v":0},{"$f":"INDIRECT(\"'ITF Form'!m51\")","v":0},{"$f":"IF($D$13=\"Perm\",ROUND(INDIRECT(\"'ITF Form'!n51\"),0),INDIRECT(\"'ITF Form'!n51\"))","v":0},null,null,null,null,null,null,null,null,null,null,null,null,"Transfer 3","UCR",{"$f":"IF($D20=0,\"\",$D20)","v":""},{"$f":"IF($D20=0,\"\",IF($C$2=\"S\",VLOOKUP($C$5,ITFAccounts[],2,FALSE),IF($C$2=\"R\",VLOOKUP($C$5,ITFAccounts[],3,FALSE),\"\")))","v":""},null,{"$f":"IF($G20=0,\"\",$G20)","v":""},null,"",{"$f":"IF(D20=0,\"\",IF(D20=\"1531\",\"A41479\",\"A01479\"))","v":""},null,null,{"$f":"IF($D$13=\"Temp\",IF($C$2=\"S\",IF($N20=0,\"\",$N20),\"\"),\"\")","v":""},{"$f":"IF($D$13=\"Temp\",IF($C$2=\"R\",IF($N20=0,\"\",$N20),\"\"),\"\")","v":""},{"$f":"IF($D$13=\"Perm\",IF($C$2=\"S\",IF($N20=0,\"\",$N20),\"\"),\"\")","v":""},{"$f":"IF($D$13=\"Perm\",IF($C$2=\"R\",IF($N20=0,\"\",$N20),\"\"),\"\")","v":""},{"$f":"IF($M20=0,\"\",$M20)","v":""},""]
{"$rows_left_out":82}
{"sheet":"Rules","index":3,"n_rows":53,"n_cols":21,"rows_kept":53,"cut":false,"hidden":false,"merged":[[0,0,0,6],[0,9,0,16]]}
["Funds Table",null,null,null,null,null,null,null,null,"Other Funds Not on Funds Table",null,null,null,null,null,null,null,null,"ITF Accounts","DEBIT (Sending)","CREDIT (Receiving)"]
["Fund","Fund Description","Journal","Fund Type","Account","Function","Activity-Entity 1511","Activity - Entity 1531",null,"Fund","Fund Description","Journal","Fund Type","Account","Function","Activity-Entity 1511","Activity-Entity 1531",null,"Campus","Debit","Credit"]
[19900,"GENERAL FUNDS","Yes","State General Funds",481000,"00","A01390","A41390",null,"21XXX",null,"Varies","Hatch Funds",405000,"00","A01390","A41390",null,"UCB","780010 ","785010 "]
[19902,"BUDGET ACT ONE TIME APPROP","No","Specific State Appropriations",481011,"00","A01390","A41390",null,"Other Funds",null,"Varies","Varies",440000,"00","A01479","A41479",null,"UCSF","780020 ","785020 "]
[19911,"M-C RESEARCH PROGS & INITIATIV","Yes","State General Funds",481000,"00","A01390","A41390",null,null,null,null,null,null,null,null,null,null,"UCD","780030 ","785030 "]
[19912,"IMPROVE GRAD RATES DISAD STDT","Yes","State General Funds",481000,"00","A01390","A41390",null,null,null,null,null,null,null,null,null,null,"UCLA","780040 ","785040 "]
[19917,"INSTRUCTIONAL TECHNOLOGY","Yes","State General Funds",481000,"00","A01390","A41390",null,null,null,null,null,null,null,null,null,null,"UCR","780050 ","785050 "]
[19921,"ONLINE EDUCATION","Yes","State General Funds",481000,"00","A01390","A41390",null,null,null,null,null,null,null,null,null,null,"UCSD","780060 ","785060 "]
[19924,"STUDENT ACADEMIC PREP PROGS","Varies - No for One-Time","State General Funds",481000,"00","A01390","A41390",null,null,null,null,null,null,null,null,null,null,"UCSC","780070 ","785070 "]
[19929,"UC GF UCPath","Yes","State General Funds",481000,"00","A01390","A41390",null,null,null,null,null,null,null,null,null,null,"UCSB","780080 ","785080 "]
[19935,"UC GF FINANCIAL SYSTEM","Yes","State General Funds",481000,"00","A01390","A41390",null,null,null,null,null,null,null,null,null,null,"UCI","780090 ","785090 "]
[19936,"CAMPUS DESIGNATED GEN FUND1","No","State General Funds",481011,"00","A01390","A41390",null,null,null,null,null,null,null,null,null,null,"UCM","780100 ","785100 "]
[19937,"CAMPUS DESIGNATED GEN FUND2","Varies - No for One-Time","State General Funds",481000,"00","A01390","A41390",null,null,null,null,null,null,null,null,null,null,"UCOP","780110 ","785110 "]
[19938,"CAMPUS DESIGNATED GEN FUND3","No","State General Funds",481011,"00","A01390","A41390",null,null,null,null,null,null,null,null,null,null,"ANR","780120 ","785120 "]
[19939,"CAMPUS DESIGNATED GEN FUND4","No","State General Funds",481011,"00","A01390","A41390"]
[19948,"LEASE PURCHASE DEBT SAVINGS","No","State General Funds",481011,"00","A01390","A41390"]
[19954,"INNOVATION AND ENTREPRENEURSHP","No","State General Funds",481011,"00","A01390","A41390"]
[19955,"SUPPRT FOR LOW INCOME URM LCFF","No","State General Funds",481011,"00","A01390","A41390"]
[19958,"FACULTY DIVERSITY BEST PRACTIC","No","State General Funds",481011,"00","A01390","A41390"]
[19961,"SUBJECT MATTER PROJECTS","No","State General Funds",481011,"00","A01390","A41390"]
{"$rows_left_out":34}
{"sheet":"Business Office Use Only","index":4,"n_rows":3,"n_cols":1,"rows_kept":3,"cut":false,"hidden":false,"merged":[]}
[]
[]
["Selecting 'Submit' will clear existing data on the \"UCOP Upload\" tab and populate with new data based on entries on the \"ITF Form\" tab."]

{"sheet":"Sheet1","index":5,"n_rows":7,"n_cols":17,"rows_kept":7,"cut":false,"hidden":false,"merged":[[0,0,0,9],[1,0,1,4],[1,5,1,8],[1,9,1,13],[2,0,2,4],[2,5,2,8],[2,9,2,13]]}
["The ITF document template allows you to create transactions in Excel and automatically load them into ITF Online.  Please enter information only in the light blue shaded areas.  You may insert or delete rows in between row 5 and 20."]
["Subject Line",null,null,null,null,"Explanation",null,null,null,"Comments - (Sys Budget Office Use Only)"]
[0,null,null,null,null,"Explanation"]
["Entity Level C","Account Level E","Account Level D","Fund Level D","Fund Level C","Function Code","Department","Project","Program","GL Transfer From (DR.)","GL Transfer To (CR.)","Perm. Trf. From (DR.)  [Omit Cents]","Perm. Trf. To (CR.) [Omit Cents]","Description","Campus Comments","Flex 1","Flex 2"]
["1511","780040 ",null,"19902",null,"44","A01479",null,null,2500,"","","","ITF Laura ","UCLA-1511-BC75-A01675-19902-44-000--0-0-"]
["1511",481011,null,"19902",null,"00","A01390",null,null,"",2500,"","","ITF Laura ","UCLA-1511-BC75-A01675-19902-44-000--0-0-"]
["","",null,"",null,"","","","","","","","","","","",""]